+ Responder ao Tópico



  1. #1

    Padrão Erro ao compilar kernel 2.6.23.9 + Patch o matic + iptables 1.3.8 + layer7

    Bom dia a todos,


    Gostaria de saber se alguem já vivenciou esse problema, ou se pelo menos tenha idéia do que possa vir a ser.... quando eu tento compilar o kernel 2.6.23.9 no slack 12, com o patch o matic, iptables 1.38 e layer7 aparece a seguinte mensagem:

    net/ipv4/netfilter/ipt_psd.c: In function 'ipt_psd_match':
    net/ipv4/netfilter/ipt_psd.c:117: error: 'const struct sk_buff' has no member named 'nh'
    net/ipv4/netfilter/ipt_psd.c:177: warning: comparison of distinct pointer types lacks a cast
    net/ipv4/netfilter/ipt_psd.c:177: warning: comparison of distinct pointer types lacks a cast
    net/ipv4/netfilter/ipt_psd.c: At top level:
    net/ipv4/netfilter/ipt_psd.c:334: warning: initialization from incompatible pointer type
    net/ipv4/netfilter/ipt_psd.c:335: warning: initialization from incompatible pointer type
    net/ipv4/netfilter/ipt_psd.c: In function 'init':
    net/ipv4/netfilter/ipt_psd.c:340: error: implicit declaration of function 'ipt_register_match'
    net/ipv4/netfilter/ipt_psd.c: In function 'fini':
    net/ipv4/netfilter/ipt_psd.c:353: error: implicit declaration of function 'ipt_unregister_match'
    make[3]: *** [net/ipv4/netfilter/ipt_psd.o] Error 1
    make[2]: *** [net/ipv4/netfilter] Error 2
    make[1]: *** [net/ipv4] Error 2
    make: *** [net] Error 2

    eu estou tentando fazer esse procedimento seguindo esse tutorial:

    Linux: Compilando kernel com suporte a POM (path-omatic) e Layer7 no Debian e Slackware [Artigo]

  2. #2

    Padrão

    o layer 7 tem suporte apenas para até verção 2.6.23 do kernel, posteriores nao saiu nenhum update

    netfilter-layer7-v2.16
    kernel-2.6.22-2.6.23-layer7-2.16.patch



  3. #3

    Padrão

    Certo.... isso é algo q eu nao tinha notado mesmo....

    mas esse erro será q é referente a isso mesmo ???


    Vlw

  4. #4

    Padrão

    Boa tarde,

    Acabei de fazer o teste utilizando o source do kernel 2.6.23, mas mesmo assim nao deu certo.... ocorre o mesmo erro...

    o que será q pode ser hein ??



  5. #5

    Padrão

    desativa este modulo psd

  6. #6

    Padrão

    quando você aplica o patch aparece alguma mensagem de erro ou warning??



  7. #7

    Padrão

    Citação Postado originalmente por lucianogf Ver Post
    quando você aplica o patch aparece alguma mensagem de erro ou warning??
    nao... eu executo o patch e clico em yes... e nao dá erro nenhum....

  8. #8