+ Responder ao Tópico



  1. #1
    F1R3W4LL
    blz galera?!?!?
    Alguem jah viu este erro ao recompilar o kernel 2.4.21, apos o comando "make bzImage" ??? <IMG SRC="images/forum/icons/icon_mad.gif">
    .
    .
    .
    make[3]: Entering directory `/usr/src/linux-2.4.21/drivers/ide/pci&acute;
    make all_targets
    make[4]: Entering directory `/usr/src/linux-2.4.21/drivers/ide/pci&acute;
    gcc -D__KERNEL__ -I/usr/src/linux-2.4.21/include -Wall -Wstrict-prototypes -Wno-trigraphs -O2 -fno-strict-aliasing -fno-common -fomit-frame-pointer -pipe -mpreferred-stack-boundary=2 -march=k6 -I../ -nostdinc -iwithprefix include -DKBUILD_BASENAME=aec62xx -c -o aec62xx.o aec62xx.c
    gcc -D__KERNEL__ -I/usr/src/linux-2.4.21/include -Wall -Wstrict-prototypes -Wno-trigraphs -O2 -fno-strict-aliasing -fno-common -fomit-frame-pointer -pipe -mpreferred-stack-boundary=2 -march=k6 -I../ -nostdinc -iwithprefix include -DKBUILD_BASENAME=alim15x3 -c -o alim15x3.o alim15x3.c
    gcc -D__KERNEL__ -I/usr/src/linux-2.4.21/include -Wall -Wstrict-prototypes -Wno-trigraphs -O2 -fno-strict-aliasing -fno-common -fomit-frame-pointer -pipe -mpreferred-stack-boundary=2 -march=k6 -I../ -nostdinc -iwithprefix include -DKBUILD_BASENAME=amd74xx -c -o amd74xx.o amd74xx.c
    amd74xx.c: In function `amd74xx_get_info&acute;:
    amd74xx.c:177: Internal error: Segmentation fault.
    Please submit a full bug report.
    See <URL:http://bugzilla.redhat.com/bugzilla/> for instructions.
    make[4]: *** [amd74xx.o] Error 2
    make[4]: Leaving directory `/usr/src/linux-2.4.21/drivers/ide/pci&acute;
    make[3]: *** [first_rule] Error 2
    make[3]: Leaving directory `/usr/src/linux-2.4.21/drivers/ide/pci&acute;
    make[2]: *** [_subdir_pci] Error 2
    make[2]: Leaving directory `/usr/src/linux-2.4.21/drivers/ide&acute;
    make[1]: *** [_subdir_ide] Error 2
    make[1]: Leaving directory `/usr/src/linux-2.4.21/drivers&acute;
    make: *** [_dir_drivers] Error 2
    [root@server linux-2.4.21]#


    []&acute;s
    Gustavo <IMG SRC="images/forum/icons/icon27.gif"> <IMG SRC="images/forum/icons/icon27.gif"> <IMG SRC="images/forum/icons/icon27.gif">

  2. #2
    menino_maluquinho
    Tive alguns problemas de segmentation fault com o RH9, acredito que foi por causa do gcc 3.2.2
    Mas não sei cisso c aplica a vc.

    A grande pergunta é:
    Vc precisa desse modulo?? (amd74xx.o)

    Caso nõ precise, tente removelo da compilacao do seu kernel pra ver c resolve.




  3. #3
    F1R3W4LL
    esse modulo eh dah arquitetura do processador....
    AMD






Tópicos Similares

  1. Erro ao compilar kernel 2.6
    Por nikolas no fórum Servidores de Rede
    Respostas: 2
    Último Post: 02-06-2006, 08:21
  2. Problemas ao compilar kernel 2.6
    Por dmarchetti no fórum Servidores de Rede
    Respostas: 1
    Último Post: 18-07-2005, 16:37
  3. Error Ao compilar plugin-nagios
    Por Bili no fórum Servidores de Rede
    Respostas: 7
    Último Post: 15-06-2005, 15:21
  4. Erro ao compilar kernel 2.6.10 (Inconsistent Kallsyms data)
    Por gregorioenrico no fórum Servidores de Rede
    Respostas: 0
    Último Post: 09-01-2005, 00:38
  5. Erro em modulo ao compilar kernel
    Por dr4k no fórum Servidores de Rede
    Respostas: 3
    Último Post: 11-03-2003, 22:50

Visite: BR-Linux ·  VivaOLinux ·  Dicas-L