Página 1 de 2 12 ÚltimoÚltimo
+ Responder ao Tópico



  1. to usando o slackware 10

    to numa correria....e não to conseguindo resolver..:

    esse erro quando vou instalar qualquer aplicativo via ./configure

    olhem esse bendito erro:

    checking build system type... i686-pc-linux-gnulibc1
    checking host system type... i686-pc-linux-gnulibc1
    checking target system type... i686-pc-linux-gnulibc1
    checking for a BSD-compatible install... /usr/bin/ginstall -c
    checking whether build environment is sane... yes
    checking for gawk... gawk
    checking whether make sets $(MAKE)... yes
    checking for gawk... (cached) gawk
    checking for style of include used by make... GNU
    checking for gcc... gcc
    checking for C compiler default output file name... configure: error: C compiler cannot create executables
    See `config.log' for more details.


    e o detalhe é os eguinte..já vi no vivaolinux que tem que instalar todos os pacotes da pasta D do CD 1 mas já instalei todos e até agora nada..não funfa..dá erro....
    gostaria de uma força ..pra eu tentar resolver esse erro...pois todos os meus servidores dá esse erro...o que será que está faltando no meu slackware 10, na hora de instalar..pra não ficar dando mais esse erro!

    gostaria de uma ajuda!

    Obrigado desde já

    Fabiano

  2. #2
    chakalt
    Cara ta faltando as bibliotecas GCC baixa e instala a vai o link

    http://superdownloads.ubbi.com.br/li...nload/i48.html

    até mais!



  3. chakalt Enviada: Sáb Jun 18, 2005 7:03 am Assunto:

    --------------------------------------------------------------------------------

    Cara ta faltando as bibliotecas GCC baixa e instala a vai o link

    http://superdownloads.ubbi.com.br/li...nload/i48.html

    até mais!


    +++++++++++++++++++++++++++++++++++++++++++

    O DURO QUE EST´AINSTALADO SIM OLHE SÓH:


    root@Servidor:/ntop# slapt-get --search gcc
    gcc 3.3.4-i486-1 [inst=yes]: gcc (Base GCC package with C support)
    gcc-g++ 3.3.4-i486-1 [inst=yes]: gcc-g++ (C++ for GCC)
    gcc-g77 3.3.4-i486-1 [inst=yes]: gcc-g77 (Fortran support for GCC)
    gcc-gnat 3.3.4-i486-2 [inst=yes]: gcc-gnat (Ada support for GCC)
    gcc-java 3.3.4-i486-1 [inst=yes]: gcc-java (Java support for GCC)
    gcc-objc 3.3.4-i486-1 [inst=yes]: gcc-objc (Objective-C support for GCC)
    linux-faqs 20030907-noarch-1 [inst=yes]: linux-faqs (Linux FAQ collection from ibiblio.org)

    e mesmo assim não funciona!!


    tem mais alguma dica???

    Obrigado

  4. #4
    whinston
    no erro, o programa diz que gerou um log. gerou mesmo?
    cola pra gente



  5. galera..

    olha o erro mais detalhado no config.log

    segue:

    gcc version 3.3.4
    configure:2523: $? = 0
    configure:2525: gcc -V </dev/null >&5
    gcc: `-V' option must have argument
    configure:2528: $? = 1
    configure:2551: checking for C compiler default output file name
    configure:2554: gcc conftest.c >&5
    /usr/lib/gcc-lib/i486-slackware-linux/3.3.4/../../../../i486-slackware-linux/bin/ld: crt1.o: No such file: No such file or di
    rectory
    collect2: ld returned 1 exit status
    configure:2557: $? = 1
    configure: failed program was:
    | /* confdefs.h. */
    |
    | #define PACKAGE_NAME "ntop"
    | #define PACKAGE_TARNAME "ntop"
    | #define PACKAGE_VERSION "3.1"
    | #define PACKAGE_STRING "ntop 3.1"
    | #define PACKAGE_BUGREPORT ""
    | #define PACKAGE "ntop"
    | #define VERSION "3.1"
    | /* end confdefs.h. */
    |
    | int
    | main ()
    | {
    |
    | ;
    | return 0;
    | }
    configure:2596: error: C compiler cannot create executables
    See `config.log' for more details.



    AGORA....NÃO TO CONSEGUINDO ACHAR A BIBLIOTECA QUE FALTA

    Deem uma força!

    Obrigado






Tópicos Similares

  1. configure: error: No C# compiler found
    Por Duca no fórum Sistemas Operacionais
    Respostas: 0
    Último Post: 10-03-2006, 15:55
  2. configure: error: no acceptable C compiler found in $PATH !!
    Por eagm no fórum Servidores de Rede
    Respostas: 1
    Último Post: 16-05-2005, 15:44
  3. checking for C compiler default output... configure: error:
    Por farra_br no fórum Servidores de Rede
    Respostas: 1
    Último Post: 02-08-2004, 17:49
  4. configure: error: C compiler cannot create executables
    Por Mandos no fórum Servidores de Rede
    Respostas: 1
    Último Post: 15-01-2004, 08:29
  5. checking for test routines... configure: error: cant find te
    Por Itise no fórum Servidores de Rede
    Respostas: 1
    Último Post: 27-02-2003, 10:06

Visite: BR-Linux ·  VivaOLinux ·  Dicas-L