Página 1 de 4 1234 ÚltimoÚltimo
+ Responder ao Tópico



  1. #1
    alexandresamorim
    Boa tarde galera estou com problema em instalar o zebedee no linux slackware 10.1

    O que foi feito?

    Bem primeiro baixei o zebedee 2.4.1.tar.gz.
    depois; tar -zxvf zebedee 2.4.1.tar.gz.
    cd zebedee-2.4.1/
    make e ai vem o erro

    Use 'make OS=xxx' where xxx is win32, linux, solaris, freebsd, tru64, irix, hpux, macosx or bsdi
    make: *** [precheck] Error 1


    Grato
    alexandreamorim

  2. nao eh um erro... eh q o make dele eh diferente

    pra instalar ele, vc deve executar como root:
    Código :
    ./configure
    make OS=linux
    make install

    []'s



  3. #3
    alexandresamorim
    Obrigado......mas deu outro erro. olhe abaixo



    root@bdados:/etc/zebedee/zebedee-2.5.2# make install OS=linux
    gcc -pthread -Wall -O3 -DHAVE_PTHREADS -I. -I../blowfish-0.9.5a -I../zlib-1.1.4 -I../bzip2-1.0.1 -c -o zebedee.o zebedee.c
    zebedee.c:62:22: blowfish.h: No such file or directory
    zebedee.c:323: error: parse error before "BF_KEY"
    zebedee.c:323: warning: no semicolon at end of struct or union

    zebedee.c: In function `makeMsgBuf':
    zebedee.c:1293: error: `msg' undeclared (first use in this function)
    zebedee.c:1293: error: (Each undeclared identifier is reported only once
    zebedee.c:1293: error: for each function it appears in.)
    zebedee.c:1296: error: parse error before ')' token
    zebedee.c: At top level:
    zebedee.c:1302: error: parse error before '->' token
    zebedee.c:1337: warning: type defaults to `int' in declaration of `free'
    zebedee.c:1337: warning: parameter names (without types) in function declaration
    zebedee.c:1337: error: conflicting types for `free'
    /usr/include/stdlib.h:597: error: previous declaration of `free'
    zebedee.c:1337: warning: data definition has no type or storage class
    zebedee.c:1338: error: parse error before "return"
    zebedee.c:1352: error: parse error before '*' token
    zebedee.c: In function `freeMsgBuf':
    zebedee.c:1354: error: `msg' undeclared (first use in this function)
    zebedee.c: At top level:
    zebedee.c:1370: error: parse error before '*' token
    zebedee.c: In function `setMsgBuf':
    zebedee.c:1390: error: `msg' undeclared (first use in this function)
    zebedee.c:1390: error: `size' undeclared (first use in this function)
    zebedee.c:1391: error: `buffer' undeclared (first use in this function)
    zebedee.c: At top level:
    zebedee.c:1412: error: parse error before "MsgBuf_t"
    zebedee.c: In function `readMessage':
    zebedee.c:1429: error: `fd' undeclared (first use in this function)
    zebedee.c:1438: error: `thisSize' undeclared (first use in this function)
    zebedee.c:1438: error: `msg' undeclared (first use in this function)
    zebedee.c:1468: warning: implicit declaration of function `BF_cfb64_encrypt'
    zebedee.c:1470: error: `BF_DECRYPT' undeclared (first use in this function)
    zebedee.c:1564: warning: dereferencing type-punned pointer will break strict-aliasing rules
    zebedee.c: At top level:
    zebedee.c:1614: error: parse error before "MsgBuf_t"
    zebedee.c: In function `writeMessage':
    zebedee.c:1616: error: `msg' undeclared (first use in this function)
    zebedee.c:1647: warning: dereferencing type-punned pointer will break strict-aliasing rules
    zebedee.c:1731: error: `BF_ENCRYPT' undeclared (first use in this function)
    zebedee.c:1753: error: `fd' undeclared (first use in this function)
    zebedee.c: At top level:
    zebedee.c:2854: error: parse error before '*' token
    zebedee.c:2856: warning: return type defaults to `int'
    zebedee.c: In function `setupBlowfish':
    zebedee.c:2857: error: `bf' undeclared (first use in this function)
    zebedee.c:2858: error: `BF_ROUNDS' undeclared (first use in this function)
    zebedee.c:2868: error: parse error before ')' token
    zebedee.c:2858: warning: unused variable `keyData'
    zebedee.c:2859: warning: unused variable `keyBytes'
    zebedee.c: At top level:
    zebedee.c:2875: warning: type defaults to `int' in declaration of `keyBytes'
    zebedee.c:2875: error: `keyStr' undeclared here (not in a function)
    zebedee.c:2875: error: `keyBits' undeclared here (not in a function)
    zebedee.c:2875: error: `keyData' undeclared here (not in a function)
    zebedee.c:2875: error: initializer element is not constant
    zebedee.c:2875: warning: data definition has no type or storage class
    zebedee.c:2877: error: parse error before numeric constant
    zebedee.c:2878: error: parse error before '&' token
    zebedee.c:2878: warning: type defaults to `int' in declaration of `BF_set_key'
    zebedee.c:2878: warning: type defaults to `int' in declaration of `keyBytes'
    zebedee.c:2878: warning: type defaults to `int' in declaration of `keyData'
    zebedee.c:2878: error: parse error before ')' token
    zebedee.c:2879: error: parse error before '->' token
    zebedee.c:2879: warning: type defaults to `int' in declaration of `memcpy'
    zebedee.c:2879: warning: data definition has no type or storage class
    zebedee.c:2880: error: parse error before '->' token
    zebedee.c: In function `hexStrToBits':
    zebedee.c:3414: error: `BF_ROUNDS' undeclared (first use in this function)
    zebedee.c: At top level:
    zebedee.c:3556: error: parse error before "MsgBuf_t"
    zebedee.c: In function `clientPerformChallenge':
    zebedee.c:3566: error: `serverFd' undeclared (first use in this function)
    zebedee.c:3566: error: `msg' undeclared (first use in this function)
    zebedee.c: At top level:
    zebedee.c:3641: error: parse error before "MsgBuf_t"
    zebedee.c: In function `serverPerformChallenge':
    zebedee.c:3653: error: `msg' undeclared (first use in this function)
    zebedee.c:3654: error: `clientFd' undeclared (first use in this function)
    zebedee.c: At top level:
    zebedee.c:4067: error: parse error before "MsgBuf_t"
    zebedee.c: In function `filterLoop':
    zebedee.c:4073: error: `localFd' undeclared (first use in this function)
    zebedee.c:4073: error: `remoteFd' undeclared (first use in this function)
    zebedee.c:4083: error: `udpMode' undeclared (first use in this function)
    zebedee.c:4125: error: `msgBuf' undeclared (first use in this function)
    zebedee.c:4165: error: `replyFd' undeclared (first use in this function)
    zebedee.c:4166: error: `toAddrP' undeclared (first use in this function)
    zebedee.c: In function `client':
    zebedee.c:5459: error: `msg' undeclared (first use in this function)
    zebedee.c: In function `server':
    zebedee.c:6256: error: `msg' undeclared (first use in this function)
    zebedee.c: In function `main':
    zebedee.c:8032: warning: unused variable `serviceArgs'
    make: *** [zebedee.o] Error 1


    Grato
    alexandreamorim

  4. em q distro vc estah instalando?

    veja se no seu /usr/include ou /usr/local/include existe esse arquivo blowfish.h

    se nao, instale o pacote dele...

    []'s



  5. #5
    alexandresamorim
    Esse arquivo se encontra em /usr/include/openssl/blowfish.h e a distri.... que estou usando é o slackware 10.1


    grato
    alexandreamorim






Tópicos Similares

  1. problema na instalaçao do kopete
    Por SnOrT no fórum Servidores de Rede
    Respostas: 3
    Último Post: 19-11-2003, 23:49
  2. Problema na Instalação do Squid.
    Por no fórum Servidores de Rede
    Respostas: 3
    Último Post: 20-08-2003, 13:23
  3. Problemas na instalação do Mplayer
    Por Wronieri no fórum Servidores de Rede
    Respostas: 3
    Último Post: 04-07-2003, 10:03
  4. problemas na instalação do vsftpd
    Por roggy no fórum Servidores de Rede
    Respostas: 0
    Último Post: 29-05-2003, 15:41
  5. Problema na instalacao do Apache
    Por no fórum Servidores de Rede
    Respostas: 4
    Último Post: 14-05-2003, 15:09

Visite: BR-Linux ·  VivaOLinux ·  Dicas-L