+ Responder ao Tópico



  1. Boa Noite pessoal, eu estou tendo sérios problemas na instalação do xgl usando o emerge, ele retorna o seguinte erro logo no finalzinho da compilação:

    In file included from /usr/include/X11/extensions/renderproto.h:30,
    from glyphstr.h:29,
    from picturestr.h:29,
    from renderedge.h:28,
    from renderedge.c:29:
    /usr/include/X11/extensions/render.h:29: error: expected '=', ',', ';', 'asm' or '__attribute__' before 'Glyph'
    /usr/include/X11/extensions/render.h:30: error: expected '=', ',', ';', 'asm' or '__attribute__' before 'GlyphSet'
    /usr/include/X11/extensions/render.h:31: error: expected '=', ',', ';', 'asm' or '__attribute__' before 'Picture'
    /usr/include/X11/extensions/render.h:32: error: expected '=', ',', ';', 'asm' or '__attribute__' before 'PictFormat'
    In file included from picturestr.h:29,
    from renderedge.h:28,
    from renderedge.c:29:
    glyphstr.h:142: error: expected declaration specifiers or '...' before 'Glyph'
    glyphstr.h:145: error: expected declaration specifiers or '...' before 'Glyph'
    glyphstr.h:148: error: expected declaration specifiers or '...' before 'Glyph'
    In file included from renderedge.h:28,
    from renderedge.c:29:
    picturestr.h:533: error: expected ')' before 'pid'
    picturestr.h:682: error: expected ')' before 'pid'
    picturestr.h:686: error: expected ')' before 'pid'
    picturestr.h:691: error: expected ')' before 'pid'
    picturestr.h:700: error: expected ')' before 'pid'
    picturestr.h:711: error: expected ')' before 'pid'
    make[1]: *** [renderedge.lo] Error 1
    make[1]: Leaving directory `/var/tmp/portage/x11-base/xgl-0.0.1_pre20070105/work/xgl/render'
    make: *** [all-recursive] Error 1

    !!! ERROR: x11-base/xgl-0.0.1_pre20070105 failed.
    Call stack:
    ebuild.sh, line 1638: Called dyn_compile
    ebuild.sh, line 985: Called qa_call 'src_compile'
    ebuild.sh, line 44: Called src_compile
    ebuild.sh, line 1328: Called x-modular_src_compile
    x-modular.eclass, line 337: Called x-modular_src_make
    x-modular.eclass, line 332: Called die

    !!! emake failed
    !!! If you need support, post the topmost build error, and the call stack if relevant.
    !!! A complete build log is located at '/var/tmp/portage/x11-base/xgl-0.0.1_pre20070105/temp/build.log'.

    !!! This ebuild is from an overlay: '/usr/local/layman/xeffects'


    Alguém por aqui tem idéia do que significa esse erro ??

    Agradeço qualquer idéia

    []'s SoBoRo

  2. Estava com o mesmo problema q vc. Resolvi aplicando o patch a seguir no renderproto e reemergindo o mesmo:

    https://bugs.freedesktop.org/show_bug.cgi?id=12578






Tópicos Similares

  1. Problemas na instalação e no boot com Free e HD Seagate
    Por no fórum Sistemas Operacionais
    Respostas: 1
    Último Post: 22-07-2003, 13:28
  2. Problemas na instalação do Mplayer
    Por Wronieri no fórum Servidores de Rede
    Respostas: 3
    Último Post: 04-07-2003, 10:03
  3. problemas na instalação do vsftpd
    Por roggy no fórum Servidores de Rede
    Respostas: 0
    Último Post: 29-05-2003, 15:41
  4. Problema na instalacao do Apache
    Por no fórum Servidores de Rede
    Respostas: 4
    Último Post: 14-05-2003, 15:09
  5. problemas na instalaçao gcc
    Por sergiogerbelli no fórum Linguagens de Programação
    Respostas: 2
    Último Post: 28-03-2003, 07:34

Visite: BR-Linux ·  VivaOLinux ·  Dicas-L